Target
Protein cereblon
Ligand
BDBM65456
Substrate
Meas. Tech.
ChEMBL_2025843 (CHEMBL4679656)
IC50
25800±n/a nM
Citation
 Maiwald, SHeim, CHernandez Alvarez, BHartmann, MD Sweet and Blind Spots in E3 Ligase Ligand Space Revealed by a Thermophoresis-Based Assay. ACS Med Chem Lett 12:74-81 (2021)  
Target
Name:
Protein cereblon
Synonyms:
CRBN Protein cereblon
Type:
PROTEIN
Mol. Mass.:
50537.73
Organism:
Homo sapiens (Human)
Description:
ChEMBL_116917
Residue:
442
  
Inhibitor
Name:
BDBM65456
Synonyms:
19171-19-8 Actimid Pomalyst US20230271966, Compound Pomalidomide pomalidomide
Type:
Small organic molecule
Emp. Form.:
C13H11N3O4
Mol. Mass.:
273.2441
SMILES:
Nc1cccc2C(=O)N(C3CCC(=O)NC3=O)C(=O)c12
: