Target
Muscarinic acetylcholine receptor M3
Ligand
BDBM50366775
Substrate
Meas. Tech.
ChEMBL_2026000 (CHEMBL4679813)
IC50
20±n/a nM
Citation
 Schrader, TOXiong, YLorenzana, AOBroadhead, AStebbins, KJPoon, MMBaccei, CLorrain, DS Discovery of PIPE-359, a Brain-Penetrant, Selective M ACS Med Chem Lett 12:155-161 (2021)  
Target
Name:
Muscarinic acetylcholine receptor M3
Synonyms:
ACM3_HUMAN Cholinergic, muscarinic M3 Muscarinic receptor M3 | RecName: Full=Muscarinic acetylcholine receptor M3
Type:
Enzyme
Mol. Mass.:
66151.03
Organism:
Homo sapiens (Human)
Description:
P20309
Residue:
590
  
Inhibitor
Name:
BDBM50366775
Synonyms:
BENZTROPINE | Benzatropine
Type:
Small organic molecule
Emp. Form.:
C21H25NO
Mol. Mass.:
307.4293
SMILES:
CN1[C@H]2CC[C@@H]1C[C@@H](C2)OC(c1ccccc1)c1ccccc1
: