Target
Potassium voltage-gated channel subfamily H member 2
Ligand
BDBM186369
Substrate
Meas. Tech.
ChEMBL_2027231 (CHEMBL4681389)
Ki
1400±n/a nM
Citation
 Skerratt, SEAndrews, MBagal, SKBilsland, JBrown, DBungay, PJCole, SGibson, KRJones, RMorao, INedderman, AOmoto, KRobinson, CRyckmans, TSkinner, KStupple, PWaldron, G The Discovery of a Potent, Selective, and Peripherally Restricted Pan-Trk Inhibitor (PF-06273340) for the Treatment of Pain. J Med Chem 59:10084-10099 (2016)  
Target
Name:
Potassium voltage-gated channel subfamily H member 2
Synonyms:
1,3-beta-glucan synthase component GLS2 ERG Eag-related protein 1 Ether-a-go-go-related gene (HERG) Ether-a-go-go-related gene potassium channel 1 Ether-a-go-go-related gene potassium channel 1 (hERG1) Ether-a-go-go-related protein 1 H-ERG KCNH2 Potassium voltage-gated channel subfamily H member 2 (hERG) Voltage-gated potassium channel subunit Kv11.1 hERG Potassium Channel 1 | putative potassium channel subunit
Type:
Multi-pass membrane protein
Mol. Mass.:
126672.65
Organism:
Homo sapiens (Human)
Description:
Q12809
Residue:
1159
  
Inhibitor
Name:
BDBM186369
Synonyms:
US9163021, 26
Type:
Small organic molecule
Emp. Form.:
C24H24N6O2
Mol. Mass.:
428.4864
SMILES:
CC(C)n1cc(C(=O)c2cncc(NC(=O)Cn3ccc(n3)C3CC3)c2)c2cnccc12
: