Target
Interstitial collagenase
Ligand
BDBM50291705
Substrate
Meas. Tech.
ChEBML_106278
Ki
2.2±n/a nM
Citation
 Sawa, MKondo, HNishimura, S Encounter with unexpected collagenase-1 selective inhibitor: switchover of inhibitor binding pocket induced by fluorine atom. Bioorg Med Chem Lett 12:581-4 (2002)  
Target
Name:
Interstitial collagenase
Synonyms:
CLG MMP1 Matrix metalloproteinase-1 | Matrix metalloproteinase-1 (MMP-1)
Type:
Enzyme
Mol. Mass.:
54010.26
Organism:
Homo sapiens (Human)
Description:
P03956
Residue:
469
  
Inhibitor
Name:
BDBM50291705
Synonyms:
(S)-((R)-3-Hydroxycarbamoyl-3,4-dihydro-1H-isoquinolin-2-yl)-(4-methoxy-phenyl)-phosphinic acid 3,3,3-trifluoro-propyl ester | CHEMBL64689
Type:
Small organic molecule
Emp. Form.:
C20H22F3N2O5P
Mol. Mass.:
458.3681
SMILES:
COc1ccc(cc1)[P@@](=O)(OCCC(F)(F)F)N1Cc2ccccc2C[C@@H]1C(=O)NO
: