Target
Adenosine receptor A3
Ligand
BDBM82053
Substrate
Meas. Tech.
ChEMBL_2028574 (CHEMBL4682732)
Ki
22300±n/a nM
Citation
 Abdelrahman, AYerande, SGNamasivayam, VKlapschinski, TAAlnouri, MWEl-Tayeb, AMüller, CE Substituted 4-phenylthiazoles: Development of potent and selective A Eur J Med Chem 186:0 (2020)  
Target
Name:
Adenosine receptor A3
Synonyms:
A3 adenosine receptor (hA3) ADORA3 | Adenosine A3 receptor (A3AR)
Type:
G Protein-Coupled Receptor (GPCR)
Mol. Mass.:
36197.32
Organism:
Homo sapiens (Human)
Description:
P0DMS8
Residue:
318
  
Inhibitor
Name:
BDBM82053
Synonyms:
8-(2-Furyl)theophylline US9144538, Theophylline
Type:
Emp. Form.:
C7H8N4O2
Mol. Mass.:
180.164
SMILES:
Cn1c2[nH]cnc2c(=O)n(C)c1=O
: