Target
Melatonin receptor type 1A
Ligand
BDBM50035179
Substrate
Meas. Tech.
ChEMBL_2030737 (CHEMBL4684895)
Ki
0.120000±n/a nM
Citation
 Bolteau, RDescamps, FEttaoussi, MCaignard, DHDelagrange, PMelnyk, PYous, S Quinazoline and phthalazine derivatives as novel melatonin receptor ligands analogues of agomelatine. Eur J Med Chem 189:0 (2020)  
Target
Name:
Melatonin receptor type 1A
Synonyms:
MTNR1A MTR1A_HUMAN Mel1a melatonin receptor Melatonin receptor Melatonin receptor type 1 (MT1) | Melatonin receptor type 1A
Type:
Enzyme
Mol. Mass.:
39392.94
Organism:
Homo sapiens (Human)
Description:
P48039
Residue:
350
  
Inhibitor
Name:
BDBM50035179
Synonyms:
Agomelatine N-[2-(7-Methoxy-naphthalen-1-yl)-ethyl]-acetamide S 20098 US11091445, Compound code IA2-76
Type:
Small organic molecule
Emp. Form.:
C15H17NO2
Mol. Mass.:
243.301
SMILES:
COc1ccc2cccc(CCNC(C)=O)c2c1
: