Target
D(1A) dopamine receptor
Ligand
BDBM50318484
Substrate
Meas. Tech.
ChEMBL_2033536 (CHEMBL4687694)
Ki
2700±n/a nM
Citation
 Nelson, KMBisson, JSingh, GGraham, JGChen, SNFriesen, JBDahlin, JLNiemitz, MWalters, MAPauli, GF The Essential Medicinal Chemistry of Cannabidiol (CBD). J Med Chem 63:12137-12155 (2020)  
Target
Name:
D(1A) dopamine receptor
Synonyms:
DA D1 receptor DRD1 Dopamine D1 receptor Dopamine D1A
Type:
Enzyme
Mol. Mass.:
49303.43
Organism:
Homo sapiens (Human)
Description:
P21728
Residue:
446
  
Inhibitor
Name:
BDBM50318484
Synonyms:
2-((1R,6R)-6-Isopropenyl-3-methyl-cyclohex-2-enyl)-5-pentyl-benzene-1,3-diol CHEMBL190461
Type:
Small organic molecule
Emp. Form.:
C21H30O2
Mol. Mass.:
314.4617
SMILES:
CCCCCc1cc(O)c([C@@H]2C=C(C)CC[C@H]2C(C)=C)c(O)c1
: