Target
Cytochrome P450 1A1
Ligand
BDBM50318484
Substrate
Meas. Tech.
ChEMBL_2033559 (CHEMBL4687717)
Ki
160±n/a nM
Citation
 Nelson, KMBisson, JSingh, GGraham, JGChen, SNFriesen, JBDahlin, JLNiemitz, MWalters, MAPauli, GF The Essential Medicinal Chemistry of Cannabidiol (CBD). J Med Chem 63:12137-12155 (2020)  
Target
Name:
Cytochrome P450 1A1
Synonyms:
CP1A1_HUMAN CYPIA1 Cytochrome P450 1A1 P450 form 6 P450-P1
Type:
Protein
Mol. Mass.:
58177.23
Organism:
Homo sapiens (Human)
Description:
P04798
Residue:
512
  
Inhibitor
Name:
BDBM50318484
Synonyms:
2-((1R,6R)-6-Isopropenyl-3-methyl-cyclohex-2-enyl)-5-pentyl-benzene-1,3-diol CHEMBL190461
Type:
Small organic molecule
Emp. Form.:
C21H30O2
Mol. Mass.:
314.4617
SMILES:
CCCCCc1cc(O)c([C@@H]2C=C(C)CC[C@H]2C(C)=C)c(O)c1
: