Target
Cytochrome P450 2C11
Ligand
BDBM50318484
Substrate
Meas. Tech.
ChEMBL_2033573 (CHEMBL4687731)
Ki
20700±n/a nM
Citation
 Nelson, KMBisson, JSingh, GGraham, JGChen, SNFriesen, JBDahlin, JLNiemitz, MWalters, MAPauli, GF The Essential Medicinal Chemistry of Cannabidiol (CBD). J Med Chem 63:12137-12155 (2020)  
Target
Name:
Cytochrome P450 2C11
Synonyms:
CP2CB_RAT Cyp2c-11 | Cyp2c11
Type:
PROTEIN
Mol. Mass.:
57187.48
Organism:
Rattus norvegicus
Description:
ChEMBL_100121
Residue:
500
  
Inhibitor
Name:
BDBM50318484
Synonyms:
2-((1R,6R)-6-Isopropenyl-3-methyl-cyclohex-2-enyl)-5-pentyl-benzene-1,3-diol CHEMBL190461
Type:
Small organic molecule
Emp. Form.:
C21H30O2
Mol. Mass.:
314.4617
SMILES:
CCCCCc1cc(O)c([C@@H]2C=C(C)CC[C@H]2C(C)=C)c(O)c1
: