Target
Histamine H4 receptor
Ligand
BDBM50552429
Substrate
Meas. Tech.
ChEMBL_2034380 (CHEMBL4688538)
Ki
<10000±n/a nM
Citation
 Corrêa, MFBalico-Silva, ALKiss, DJFernandes, GABMaraschin, JCParreiras-E-Silva, LTVarela, MTSimões, SCBouvier, MKeser?, GMCosta-Neto, CMFernandes, JPS Novel potent (dihydro)benzofuranyl piperazines as human histamine receptor ligands - Functional characterization and modeling studies on H Bioorg Med Chem 30:0 (2021)  
Target
Name:
Histamine H4 receptor
Synonyms:
AXOR35 GPCR105 HH4R HRH4 Histamine H4 receptor Histamine receptor (H3 and H4) SP9144
Type:
G Protein-Coupled Receptor (GPCR)
Mol. Mass.:
44517.02
Organism:
Homo sapiens (Human)
Description:
Binding assays were using CHO cells stably expressing hH4R receptors.
Residue:
390
  
Inhibitor
Name:
BDBM50552429
Synonyms:
CHEMBL4752345
Type:
Small organic molecule
Emp. Form.:
C19H22N2O
Mol. Mass.:
294.3908
SMILES:
C(C1Cc2cc(ccc2O1)-c1ccccc1)N1CCNCC1
: