Target
Histamine H3 receptor
Ligand
BDBM50552435
Substrate
Meas. Tech.
ChEMBL_2034381 (CHEMBL4688539)
Ki
16±n/a nM
Citation
 Corrêa, MFBalico-Silva, ALKiss, DJFernandes, GABMaraschin, JCParreiras-E-Silva, LTVarela, MTSimões, SCBouvier, MKeser?, GMCosta-Neto, CMFernandes, JPS Novel potent (dihydro)benzofuranyl piperazines as human histamine receptor ligands - Functional characterization and modeling studies on H Bioorg Med Chem 30:0 (2021)  
Target
Name:
Histamine H3 receptor
Synonyms:
G-protein coupled receptor 97 HH3R HRH3 Histamine H3 receptor (H3) Histamine receptor (H3 and H4)
Type:
G Protein-Coupled Receptor (GPCR)
Mol. Mass.:
48691.47
Organism:
Homo sapiens (Human)
Description:
Binding assays were using CHO cells stably expressing hH3R receptors.
Residue:
445
  
Inhibitor
Name:
BDBM50552435
Synonyms:
CHEMBL4756432
Type:
Small organic molecule
Emp. Form.:
C20H30N2O
Mol. Mass.:
314.465
SMILES:
CC(C)(C)c1ccc2OC(CN3CCN(CC=C)CC3)Cc2c1
: