Target
Arginase-1
Ligand
BDBM50553165
Substrate
Meas. Tech.
ChEMBL_2045303 (CHEMBL4700002)
Ki
82000±n/a nM
Citation
 Muller, JCardey, BZedet, ADesingle, CGrzybowski, MPomper, PFoley, SHarakat, DRamseyer, CGirard, CPudlo, M Synthesis, evaluation and molecular modelling of piceatannol analogues as arginase inhibitors. RSC Med Chem 11:559-568 (2020)  
Target
Name:
Arginase-1
Synonyms:
ARG1 Liver-type arginase | Type I arginase
Type:
PROTEIN
Mol. Mass.:
35008.90
Organism:
Bos taurus
Description:
ChEMBL_474406
Residue:
322
  
Inhibitor
Name:
BDBM50553165
Synonyms:
CHEMBL4754674
Type:
Small organic molecule
Emp. Form.:
C13H13NO4
Mol. Mass.:
247.2466
SMILES:
Oc1ccc(CNc2ccc(O)c(O)c2)cc1O
: