Target
Vasopressin V1a receptor
Ligand
BDBM50108498
Substrate
Meas. Tech.
ChEMBL_214561 (CHEMBL820178)
Ki
0.16±n/a nM
Citation
 Kakefuda, ASuzuki, TTobe, TTsukada, JTahara, ASakamoto, STsukamoto, S Synthesis and pharmacological evaluation of 5-(4-biphenyl)-3-methyl-4-phenyl-1,2,4-triazole derivatives as a novel class of selective antagonists for the human vasopressin V(1A) receptor. J Med Chem 45:2589-98 (2002)  
Target
Name:
Vasopressin V1a receptor
Synonyms:
Avpr1a VASOPRESSIN V1A Vasopressin V1a receptor | Vasopressin receptor
Type:
Enzyme Catalytic Domain
Mol. Mass.:
47674.81
Organism:
RAT
Description:
VASOPRESSIN V1A AVPR1A RAT::P30560
Residue:
424
  
Inhibitor
Name:
BDBM50108498
Synonyms:
Biphenyl-2-carboxylic acid (4-{5-[2-(4-dimethylamino-piperidin-1-yl)-2-oxo-ethylidene]-4,4-difluoro-2,3,4,5-tetrahydro-benzo[b]azepine-1-carbonyl}-phenyl)-amide | CHEMBL307483
Type:
Small organic molecule
Emp. Form.:
C39H38F2N4O3
Mol. Mass.:
648.7408
SMILES:
CN(C)C1CCN(CC1)C(=O)\C=C1\c2ccccc2N(CCC1(F)F)C(=O)c1ccc(NC(=O)c2ccccc2-c2ccccc2)cc1
: