Target
NACHT, LRR and PYD domains-containing protein 3
Ligand
BDBM50553900
Substrate
Meas. Tech.
ChEMBL_2047575 (CHEMBL4702274)
IC50
28±n/a nM
Citation
 Harrison, DBoutard, NBrzozka, KBugaj, MChmielewski, SCierpich, ADoedens, JRFabritius, CRYGabel, CAGalezowski, MKowalczyk, PLevenets, OMroczkowska, MPalica, KPorter, RASchultz, DSowinska, MTopolnicki, GUrbanski, PWoyciechowski, JWatt, AP Discovery of a series of ester-substituted NLRP3 inflammasome inhibitors. Bioorg Med Chem Lett 30:0 (2020)  
Target
Name:
NACHT, LRR and PYD domains-containing protein 3
Synonyms:
C1orf7 NALP3 NLRP3 protein PYPAF1
Type:
Enzyme Catalytic Domain
Mol. Mass.:
118173.88
Organism:
Homo sapiens (Human)
Description:
Q96P20
Residue:
1036
  
Inhibitor
Name:
BDBM50553900
Synonyms:
CHEMBL4750616
Type:
Small organic molecule
Emp. Form.:
C20H23N2NaO5S
Mol. Mass.:
426.462
SMILES:
[Na;v0+].[#6]C([#6])([#8])c1coc(c1)S(=O)(=O)[#7-]-[#6](=O)-[#7]-c1c2-[#6]-[#6]-[#6]-c2cc2-[#6]-[#6]-[#6]-c12
: