Target
NACHT, LRR and PYD domains-containing protein 3
Ligand
BDBM50553944
Substrate
Meas. Tech.
ChEMBL_2047575 (CHEMBL4702274)
IC50
33±n/a nM
Citation
 Harrison, DBoutard, NBrzozka, KBugaj, MChmielewski, SCierpich, ADoedens, JRFabritius, CRYGabel, CAGalezowski, MKowalczyk, PLevenets, OMroczkowska, MPalica, KPorter, RASchultz, DSowinska, MTopolnicki, GUrbanski, PWoyciechowski, JWatt, AP Discovery of a series of ester-substituted NLRP3 inflammasome inhibitors. Bioorg Med Chem Lett 30:0 (2020)  
Target
Name:
NACHT, LRR and PYD domains-containing protein 3
Synonyms:
C1orf7 NALP3 NLRP3 protein PYPAF1
Type:
Enzyme Catalytic Domain
Mol. Mass.:
118173.88
Organism:
Homo sapiens (Human)
Description:
Q96P20
Residue:
1036
  
Inhibitor
Name:
BDBM50553944
Synonyms:
CHEMBL4780624
Type:
Small organic molecule
Emp. Form.:
C22H26N4O3
Mol. Mass.:
394.4668
SMILES:
CCOC(=O)[C@@H](Cc1ncccn1)NC(=O)Nc1c2CCCc2cc2CCCc12
: