Target
Bifunctional epoxide hydrolase 2
Ligand
BDBM408982
Substrate
Meas. Tech.
ChEMBL_2048504 (CHEMBL4703203)
Ki
0.330000±n/a nM
Citation
 Lee, KSSNg, JCYang, JHwang, SHMorisseau, CWagner, KHammock, BD Preparation and evaluation of soluble epoxide hydrolase inhibitors with improved physical properties and potencies for treating diabetic neuropathic pain. Bioorg Med Chem 28:0 (2020)  
Target
Name:
Bifunctional epoxide hydrolase 2
Synonyms:
Cytosolic epoxide hydrolase 2 EPHX2 HYES_HUMAN Soluble epoxide hydrolase (sEH) | epoxide hydrolase 2, cytoplasmic
Type:
Enzyme
Mol. Mass.:
62613.07
Organism:
Homo sapiens (Human)
Description:
P34913
Residue:
555
  
Inhibitor
Name:
BDBM408982
Synonyms:
US10377744, Compound No. 3 US11723929, Compound 3
Type:
Small organic molecule
Emp. Form.:
C18H18F3N3O4
Mol. Mass.:
397.3484
SMILES:
FC(F)(F)Oc1ccc(NC(=O)NC2CCN(CC2)C(=O)c2ccoc2)cc1
: