Target
Bifunctional epoxide hydrolase 2
Ligand
BDBM409014
Substrate
Meas. Tech.
ChEMBL_2048504 (CHEMBL4703203)
Ki
0.370000±n/a nM
Citation
 Lee, KSSNg, JCYang, JHwang, SHMorisseau, CWagner, KHammock, BD Preparation and evaluation of soluble epoxide hydrolase inhibitors with improved physical properties and potencies for treating diabetic neuropathic pain. Bioorg Med Chem 28:0 (2020)  
Target
Name:
Bifunctional epoxide hydrolase 2
Synonyms:
Cytosolic epoxide hydrolase 2 EPHX2 HYES_HUMAN Soluble epoxide hydrolase (sEH) | epoxide hydrolase 2, cytoplasmic
Type:
Enzyme
Mol. Mass.:
62613.07
Organism:
Homo sapiens (Human)
Description:
P34913
Residue:
555
  
Inhibitor
Name:
BDBM409014
Synonyms:
US10377744, Compound No. 34 US11123311, Compound 34 | US11723929, Compound 34
Type:
Small organic molecule
Emp. Form.:
C18H23F4N3O2
Mol. Mass.:
389.3877
SMILES:
CC[C@H](C)C(=O)N1CCC(CC1)NC(=O)Nc1ccc(c(F)c1)C(F)(F)F
: