Target
Palmitoleoyl-protein carboxylesterase NOTUM
Ligand
BDBM50539248
Substrate
Meas. Tech.
ChEMBL_2049889 (CHEMBL4704588)
IC50
3.9±n/a nM
Citation
 Mahy, WWillis, NJZhao, YWoodward, HLSvensson, FSipthorp, JVecchia, LRuza, RRHillier, JKjær, SFrew, SMonaghan, ABictash, MSalinas, PCWhiting, PVincent, JPJones, EYFish, PV 5-Phenyl-1,3,4-oxadiazol-2(3 J Med Chem 63:12942-12956 (2020)  
Target
Name:
Palmitoleoyl-protein carboxylesterase NOTUM
Synonyms:
NOTUM Palmitoleoyl-protein carboxylesterase NOTUM | hNOTUM
Type:
PROTEIN
Mol. Mass.:
55706.36
Organism:
Homo sapiens (Human)
Description:
ChEMBL_116492
Residue:
496
  
Inhibitor
Name:
BDBM50539248
Synonyms:
CHEMBL4633059
Type:
Small organic molecule
Emp. Form.:
C14H13F3N4O3S
Mol. Mass.:
374.338
SMILES:
CN1CN(CC1=O)C(=O)CSc1ncnc2oc(c(C)c12)C(F)(F)F
: