Target
Palmitoleoyl-protein carboxylesterase NOTUM
Ligand
BDBM50154397
Substrate
Meas. Tech.
ChEMBL_2049889 (CHEMBL4704588)
IC50
1.1±n/a nM
Citation
 Mahy, WWillis, NJZhao, YWoodward, HLSvensson, FSipthorp, JVecchia, LRuza, RRHillier, JKjær, SFrew, SMonaghan, ABictash, MSalinas, PCWhiting, PVincent, JPJones, EYFish, PV 5-Phenyl-1,3,4-oxadiazol-2(3 J Med Chem 63:12942-12956 (2020)  
Target
Name:
Palmitoleoyl-protein carboxylesterase NOTUM
Synonyms:
NOTUM Palmitoleoyl-protein carboxylesterase NOTUM | hNOTUM
Type:
PROTEIN
Mol. Mass.:
55706.36
Organism:
Homo sapiens (Human)
Description:
ChEMBL_116492
Residue:
496
  
Inhibitor
Name:
BDBM50154397
Synonyms:
CHEMBL3774760
Type:
Small organic molecule
Emp. Form.:
C11H9ClN2O2S2
Mol. Mass.:
300.784
SMILES:
OC(=O)CSc1ncnc2c(C3CC3)c(Cl)sc12
: