Target
Substance-K receptor
Ligand
BDBM50403919
Substrate
Meas. Tech.
ChEBML_209019
IC50
181±n/a nM
Citation
 Mah, RGerspacher, Mvon Sprecher, AStutz, STschinke, VAnderson, GPBertrand, CSubramanian, NBall, HA Biphenyl derivatives as novel dual NK(1)/NK(2)-receptor antagonists. Bioorg Med Chem Lett 12:2065-8 (2002)  
Target
Name:
Substance-K receptor
Synonyms:
NK-2 receptor NK2R NKNAR Neurokinin A receptor Neurokinin-2 (NK-2) SKR TACR2 Tachykinin receptor 2 (NK2) | hnk-3
Type:
Protein
Mol. Mass.:
44455.78
Organism:
Homo sapiens (Human)
Description:
P21452
Residue:
398
  
Inhibitor
Name:
BDBM50403919
Synonyms:
CHEMBL2112211
Type:
Small organic molecule
Emp. Form.:
C30H27F6N3O3
Mol. Mass.:
591.5441
SMILES:
CN(C(=O)c1cc(cc(c1)C(F)(F)F)C(F)(F)F)c1cc(ccc1-c1ccc(C)cc1)C(=O)N[C@@H]1CCCCNC1=O
: