Target
5-hydroxytryptamine receptor 1A
Ligand
BDBM433501
Substrate
Meas. Tech.
ChEMBL_2052366 (CHEMBL4707367)
Ki
0.064565±n/a nM
Citation
 Sniecikowska, JGluch-Lutwin, MBucki, AWi?ckowska, ASiwek, AJastrzebska-Wiesek, MPartyka, AWilczy?ska, DPytka, KPociecha, KCios, AWyska, EWeso?owska, APaw?owski, MVarney, MANewman-Tancredi, AKolaczkowski, M Novel Aryloxyethyl Derivatives of 1-(1-Benzoylpiperidin-4-yl)methanamine as the Extracellular Regulated Kinases 1/2 (ERK1/2) Phosphorylation-Preferring Serotonin 5-HT J Med Chem 62:2750-2771 (2019)  
Target
Name:
5-hydroxytryptamine receptor 1A
Synonyms:
5-HT-1A 5-hydroxytryptamine receptor 1A (5-HT-1A) ADRB2RL1 Dopamine D2 receptor and serotonin 1a receptor HTR1A | Serotonin receptor 1A
Type:
Mol. Mass.:
46122.49
Organism:
Homo sapiens (Human)
Description:
Residue:
422
  
Inhibitor
Name:
BDBM433501
Synonyms:
US10562853, Compound 18
Type:
Small organic molecule
Emp. Form.:
C20H22ClF2N3O2
Mol. Mass.:
409.857
SMILES:
Fc1ccc(cc1Cl)C(=O)N1CCC(F)(CNCCOc2ccccn2)CC1
: