Target
Isocitrate dehydrogenase [NADP], mitochondrial
Ligand
BDBM50503251
Substrate
Meas. Tech.
ChEMBL_2053482 (CHEMBL4708483)
IC50
36±n/a nM
Citation
 Che, JHuang, FZhang, MXu, GQu, BGao, JChen, BZhang, JYing, HHu, YHu, XZhou, YGao, ALi, JDong, X Structure-based design, synthesis and bioactivity evaluation of macrocyclic inhibitors of mutant isocitrate dehydrogenase 2 (IDH2) displaying activity in acute myeloid leukemia cells. Eur J Med Chem 203:0 (2020)  
Target
Name:
Isocitrate dehydrogenase [NADP], mitochondrial
Synonyms:
IDH2 IDHP_HUMAN | Isocitrate dehydrogenase 2 (IDH2)
Type:
Protein
Mol. Mass.:
50923.31
Organism:
Homo sapiens (Human)
Description:
Full-length wild-type
Residue:
452
  
Inhibitor
Name:
BDBM50503251
Synonyms:
AG-221 CC-90007 Free Base US10946023, Compound 288
Type:
Small organic molecule
Emp. Form.:
C19H17F6N7O
Mol. Mass.:
473.375
SMILES:
CC(C)(O)CNc1nc(Nc2ccnc(c2)C(F)(F)F)nc(n1)-c1cccc(n1)C(F)(F)F
: