Target
Neutrophil elastase
Ligand
BDBM50556037
Substrate
Meas. Tech.
ChEMBL_2054766 (CHEMBL4709767)
IC50
0.250000±n/a nM
Citation
 Mäder, PKattner, L Sulfoximines as Rising Stars in Modern Drug Discovery? Current Status and Perspective on an Emerging Functional Group in Medicinal Chemistry. J Med Chem 63:14243-14275 (2020)  
Target
Name:
Neutrophil elastase
Synonyms:
Bone marrow serine protease Coagulation factor X ELANE Elastase HLE Leukocyte elastase Medullasin Neutrophil elastase (HNE) PMN elastase Trypsin
Type:
Enzyme
Mol. Mass.:
28532.38
Organism:
Homo sapiens (Human)
Description:
P08246
Residue:
267
  
Inhibitor
Name:
BDBM50556037
Synonyms:
CHEMBL4744163
Type:
Small organic molecule
Emp. Form.:
C22H18F3N5O2S
Mol. Mass.:
473.471
SMILES:
CN1[C@@H](C(C#N)=C(C)N(C1=O)c1cccc(c1)C(F)(F)F)c1ccc(cc1S(C)(=N)=O)C#N
: