Target
Cystic fibrosis transmembrane conductance regulator
Ligand
BDBM50556433
Substrate
Meas. Tech.
ChEMBL_2056164 (CHEMBL4711165)
EC50
1060±n/a nM
Citation
 Parodi, ARighetti, GPesce, ESalis, ATasso, BUrbinati, CTomati, VDamonte, GRusnati, MPedemonte, NCichero, EMillo, E Discovery of novel VX-809 hybrid derivatives as F508del-CFTR correctors by molecular modeling, chemical synthesis and biological assays. Eur J Med Chem 208:0 (2020)  
Target
Name:
Cystic fibrosis transmembrane conductance regulator
Synonyms:
ABCC7 CFTR Channel conductance-controlling ATPase | cAMP-dependent chloride channel
Type:
Enzyme Catalytic Domain
Mol. Mass.:
168171.30
Organism:
Homo sapiens (Human)
Description:
gi_90421313
Residue:
1480
  
Inhibitor
Name:
BDBM50556433
Synonyms:
CHEMBL4752374
Type:
Small organic molecule
Emp. Form.:
C31H22N2O4S2
Mol. Mass.:
550.647
SMILES:
O=C(Nc1nc(c(s1)C(=O)c1ccc(cc1)-c1cccs1)-c1ccccc1)C1(CC1)c1ccc2OCOc2c1
: