Target
Cystic fibrosis transmembrane conductance regulator
Ligand
BDBM50556442
Substrate
Meas. Tech.
ChEMBL_2056164 (CHEMBL4711165)
EC50
400±n/a nM
Citation
 Parodi, ARighetti, GPesce, ESalis, ATasso, BUrbinati, CTomati, VDamonte, GRusnati, MPedemonte, NCichero, EMillo, E Discovery of novel VX-809 hybrid derivatives as F508del-CFTR correctors by molecular modeling, chemical synthesis and biological assays. Eur J Med Chem 208:0 (2020)  
Target
Name:
Cystic fibrosis transmembrane conductance regulator
Synonyms:
ABCC7 CFTR Channel conductance-controlling ATPase | cAMP-dependent chloride channel
Type:
Enzyme Catalytic Domain
Mol. Mass.:
168171.30
Organism:
Homo sapiens (Human)
Description:
gi_90421313
Residue:
1480
  
Inhibitor
Name:
BDBM50556442
Synonyms:
CHEMBL4788444
Type:
Small organic molecule
Emp. Form.:
C29H24N2O6S
Mol. Mass.:
528.576
SMILES:
COc1ccc(C(=O)c2sc(NC(=O)C3(CC3)c3ccc4OCOc4c3)nc2-c2ccccc2)c(OC)c1
: