Target
Adenosine receptor A2b
Ligand
BDBM50117223
Substrate
Meas. Tech.
ChEMBL_30727 (CHEMBL648806)
Ki
1030±n/a nM
Citation
 Okamura, TKurogi, YNishikawa, HHashimoto, KFujiwara, HNagao, Y 1,2,4-Triazolo[5,1-i]purine derivatives as highly potent and selective human adenosine A(3) receptor ligands. J Med Chem 45:3703-8 (2002)  
Target
Name:
Adenosine receptor A2b
Synonyms:
AA2BR_HUMAN ADORA2B Adenosine receptors A2b | Adenosine receptors; A2a & A2b
Type:
G Protein-Coupled Receptor (GPCR)
Mol. Mass.:
36341.22
Organism:
Homo sapiens (Human)
Description:
Residue:
332
  
Inhibitor
Name:
BDBM50117223
Synonyms:
5-Butyl-8-(4-methoxy-phenyl)-3H-[1,2,4]triazolo[5,1-i]purine | CHEMBL331111
Type:
Small organic molecule
Emp. Form.:
C17H18N6O
Mol. Mass.:
322.3644
SMILES:
CCCCc1nc2nc[nH]c2c2nc(nn12)-c1ccc(OC)cc1
: