Target
Adenosine receptor A1
Ligand
BDBM50117223
Substrate
Meas. Tech.
ChEMBL_27908 (CHEMBL642156)
Ki
398±n/a nM
Citation
 Okamura, TKurogi, YNishikawa, HHashimoto, KFujiwara, HNagao, Y 1,2,4-Triazolo[5,1-i]purine derivatives as highly potent and selective human adenosine A(3) receptor ligands. J Med Chem 45:3703-8 (2002)  
Target
Name:
Adenosine receptor A1
Synonyms:
A1 adenosine receptor (hA1) AA1R_HUMAN ADORA1 Adenosine A1-receptor Adenosine receptor A1 (hA1) | Adenosine transporter (AdT)
Type:
G Protein-Coupled Receptor (GPCR)
Mol. Mass.:
36520.92
Organism:
Homo sapiens (Human)
Description:
P30542
Residue:
326
  
Inhibitor
Name:
BDBM50117223
Synonyms:
5-Butyl-8-(4-methoxy-phenyl)-3H-[1,2,4]triazolo[5,1-i]purine | CHEMBL331111
Type:
Small organic molecule
Emp. Form.:
C17H18N6O
Mol. Mass.:
322.3644
SMILES:
CCCCc1nc2nc[nH]c2c2nc(nn12)-c1ccc(OC)cc1
: