Target
Fatty-acid amide hydrolase 1
Ligand
BDBM50117246
Substrate
Meas. Tech.
ChEMBL_68777 (CHEMBL686015)
Ki
1260±n/a nM
Citation
 van der Stelt, Mvan Kuik, JABari, Mvan Zadelhoff, GLeeflang, BRVeldink, GAFinazzi-Agrò, AVliegenthart, JFMaccarrone, M Oxygenated metabolites of anandamide and 2-arachidonoylglycerol: conformational analysis and interaction with cannabinoid receptors, membrane transporter, and fatty acid amide hydrolase. J Med Chem 45:3709-20 (2002)  
Target
Name:
Fatty-acid amide hydrolase 1
Synonyms:
Anandamide amidohydrolase FAAH FAAH1_HUMAN Fatty-acid amide hydrolase (FAAH) Oleamide hydrolase 1
Type:
Protein
Mol. Mass.:
63071.19
Organism:
Homo sapiens (Human)
Description:
O00519
Residue:
579
  
Inhibitor
Name:
BDBM50117246
Synonyms:
5,15-Dihydroxy-icosa-6,8,11,13-tetraenoic acid (2-hydroxy-ethyl)-amide | CHEMBL331170
Type:
Small organic molecule
Emp. Form.:
C22H37NO4
Mol. Mass.:
379.5335
SMILES:
CCCCC[C@@H](O)\C=C\C=C/C\C=C/C=C/[C@H](O)CCCC(=O)NCCO
: