Target
Cannabinoid receptor 2
Ligand
BDBM50117248
Substrate
Meas. Tech.
ChEMBL_47008 (CHEMBL658834)
Ki
>1000±n/a nM
Citation
 van der Stelt, Mvan Kuik, JABari, Mvan Zadelhoff, GLeeflang, BRVeldink, GAFinazzi-Agrò, AVliegenthart, JFMaccarrone, M Oxygenated metabolites of anandamide and 2-arachidonoylglycerol: conformational analysis and interaction with cannabinoid receptors, membrane transporter, and fatty acid amide hydrolase. J Med Chem 45:3709-20 (2002)  
Target
Name:
Cannabinoid receptor 2
Synonyms:
CANNABINOID CB2 CB2 Cannabinoid CB2 receptor Cnr2 | rCB2
Type:
Enzyme
Mol. Mass.:
39366.68
Organism:
Rattus norvegicus (Rat)
Description:
Q9QZN9
Residue:
360
  
Inhibitor
Name:
BDBM50117248
Synonyms:
5-Hydroxy-icosa-6,8,11,14-tetraenoic acid (2-hydroxy-ethyl)-amide | CHEMBL121804
Type:
Small organic molecule
Emp. Form.:
C22H37NO3
Mol. Mass.:
363.5341
SMILES:
CCCCC\C=C/C\C=C/C\C=C/C=C/[C@H](O)CCCC(=O)NCCO
: