Target
Apelin receptor
Ligand
BDBM50556827
Substrate
Meas. Tech.
ChEMBL_2057436 (CHEMBL4712437)
Ki
0.250000±n/a nM
Citation
 Wang, CXiong, MYang, CYang, DZheng, JFan, YWang, SGai, YLan, XChen, HZheng, LHuang, K PEGylated and Acylated Elabela Analogues Show Enhanced Receptor Binding, Prolonged Stability, and Remedy of Acute Kidney Injury. J Med Chem 63:16028-16042 (2020)  
Target
Name:
Apelin receptor
Synonyms:
AGTRL1 APJ_HUMAN Angiotensin receptor-like 1 Apelin receptor (APJ) G-protein coupled receptor HG11
Type:
Enzyme Catalytic Domain
Mol. Mass.:
42664.06
Organism:
Homo sapiens (Human)
Description:
P35414
Residue:
380
  
Inhibitor
Name:
BDBM50556827
Synonyms:
CHEMBL4748838
Type:
Small organic molecule
Emp. Form.:
C78H127N19O22S2
Mol. Mass.:
1747.087
SMILES:
CSCC[C@H](NC(=O)[C@H](CS)NC(=O)CC[C@H](NC(=O)CCOCCOCCOCCOCCOCCOCCN)C(O)=O)C(=O)N1CCC[C@H]1C(=O)N[C@@H](CC(C)C)C(=O)N[C@@H](Cc1c[nH]cn1)C(=O)N[C@@H](CO)C(=O)N[C@@H](CCCNC(N)=N)C(=O)N[C@@H](C(C)C)C(=O)N1CCC[C@H]1C(=O)N[C@@H](Cc1ccccc1)C(=O)N1CCC[C@H]1C(N)=O
: