Target
Ribosyldihydronicotinamide dehydrogenase [quinone]
Ligand
BDBM50118451
Substrate
Meas. Tech.
ChEMBL_104940 (CHEMBL714719)
Ki
1770±n/a nM
Citation
 Fukatsu, KUchikawa, OKawada, MYamano, TYamashita, MKato, KHirai, KHinuma, SMiyamoto, MOhkawa, S Synthesis of a novel series of benzocycloalkene derivatives as melatonin receptor agonists. J Med Chem 45:4212-21 (2002)  
Target
Name:
Ribosyldihydronicotinamide dehydrogenase [quinone]
Synonyms:
Metallothionein-3 NQO2 NRH dehydrogenase [quinone] 2 QR2 Quinone reductase 2 (NQO2) | Ribosyldihydronicotinamide dehydrogenase [quinone]
Type:
Protein
Mol. Mass.:
25917.25
Organism:
Homo sapiens (Human)
Description:
P16083
Residue:
231
  
Inhibitor
Name:
BDBM50118451
Synonyms:
2,2,2-Trifluoro-N-[2-(6-methoxy-2-phenyl-indan-1-yl)-ethyl]-acetamide | CHEMBL134544
Type:
Small organic molecule
Emp. Form.:
C20H20F3NO2
Mol. Mass.:
363.3735
SMILES:
COc1ccc2CC(C(CCNC(=O)C(F)(F)F)c2c1)c1ccccc1
: