Target
Ribosyldihydronicotinamide dehydrogenase [quinone]
Ligand
BDBM50118453
Substrate
Meas. Tech.
ChEMBL_104940 (CHEMBL714719)
Ki
2230±n/a nM
Citation
 Fukatsu, KUchikawa, OKawada, MYamano, TYamashita, MKato, KHirai, KHinuma, SMiyamoto, MOhkawa, S Synthesis of a novel series of benzocycloalkene derivatives as melatonin receptor agonists. J Med Chem 45:4212-21 (2002)  
Target
Name:
Ribosyldihydronicotinamide dehydrogenase [quinone]
Synonyms:
Metallothionein-3 NQO2 NRH dehydrogenase [quinone] 2 QR2 Quinone reductase 2 (NQO2) | Ribosyldihydronicotinamide dehydrogenase [quinone]
Type:
Protein
Mol. Mass.:
25917.25
Organism:
Homo sapiens (Human)
Description:
P16083
Residue:
231
  
Inhibitor
Name:
BDBM50118453
Synonyms:
(S) N-[2-(6-Methoxy-indan-1-yl)-ethyl]-butyramide | CHEMBL334404
Type:
Small organic molecule
Emp. Form.:
C16H23NO2
Mol. Mass.:
261.3593
SMILES:
CCCC(=O)NCC[C@@H]1CCc2ccc(OC)cc12
: