Target
Melatonin receptor type 1A
Ligand
BDBM50118470
Substrate
Meas. Tech.
ChEMBL_105243 (CHEMBL712573)
Ki
0.0138±n/a nM
Citation
 Uchikawa, OFukatsu, KTokunoh, RKawada, MMatsumoto, KImai, YHinuma, SKato, KNishikawa, HHirai, KMiyamoto, MOhkawa, S Synthesis of a novel series of tricyclic indan derivatives as melatonin receptor agonists. J Med Chem 45:4222-39 (2002)  
Target
Name:
Melatonin receptor type 1A
Synonyms:
MTNR1A MTR1A_HUMAN Mel1a melatonin receptor Melatonin receptor Melatonin receptor type 1 (MT1) | Melatonin receptor type 1A
Type:
Enzyme
Mol. Mass.:
39392.94
Organism:
Homo sapiens (Human)
Description:
P48039
Residue:
350
  
Inhibitor
Name:
BDBM50118470
Synonyms:
CHEMBL1218 RAMELTEON | Rozerem
Type:
Small organic molecule
Emp. Form.:
C16H21NO2
Mol. Mass.:
259.3434
SMILES:
CCC(=O)NCC[C@@H]1CCc2ccc3OCCc3c12
: