Target
DNA-binding protein Ikaros/Protein cereblon
Ligand
BDBM50557457
Substrate
Meas. Tech.
ChEMBL_2059191 (CHEMBL4714192)
EC50
>10000±n/a nM
Citation
 Hansen, JDCorrea, MAlexander, MNagy, MHuang, DSapienza, JLu, GLeBrun, LACathers, BEZhang, WTang, YAmmirante, MNarla, RKPiccotti, JRPourdehnad, MLopez-Girona, A CC-90009: A Cereblon E3 Ligase Modulating Drug That Promotes Selective Degradation of GSPT1 for the Treatment of Acute Myeloid Leukemia. J Med Chem 64:1835-1843 (2021)  
Target
Name:
DNA-binding protein Ikaros/Protein cereblon
Synonyms:
Cereblon/Ikaros
Type:
Mol. Mass.:
Description:
ASSAY_ID of ChEMBL is 2059191
Components:
This complex has 2 components.
Component 1
Name:
Protein cereblon
Synonyms:
CRBN Protein cereblon
Type:
PROTEIN
Mol. Mass.:
50537.73
Organism:
Homo sapiens (Human)
Description:
ChEMBL_116917
Residue:
442
  
Component 2
Name:
DNA-binding protein Ikaros
Synonyms:
DNA-binding protein Ikaros IKAROS IKZF1_HUMAN LYF1 ZNFN1A1
Type:
PROTEIN
Mol. Mass.:
57528.78
Organism:
Homo sapiens
Description:
ChEMBL_120150
Residue:
519
  
Inhibitor
Name:
BDBM50557457
Synonyms:
CHEMBL4742712
Type:
Small organic molecule
Emp. Form.:
C22H18ClF2N3O4
Mol. Mass.:
461.846
SMILES:
FC(F)(C(=O)NCc1ccc2C(=O)N(Cc2c1)C1CCC(=O)NC1=O)c1ccc(Cl)cc1
: