Target
Potassium voltage-gated channel subfamily H member 2
Ligand
BDBM50557457
Substrate
Meas. Tech.
ChEMBL_2059206 (CHEMBL4714207)
IC50
5300±n/a nM
Citation
 Hansen, JDCorrea, MAlexander, MNagy, MHuang, DSapienza, JLu, GLeBrun, LACathers, BEZhang, WTang, YAmmirante, MNarla, RKPiccotti, JRPourdehnad, MLopez-Girona, A CC-90009: A Cereblon E3 Ligase Modulating Drug That Promotes Selective Degradation of GSPT1 for the Treatment of Acute Myeloid Leukemia. J Med Chem 64:1835-1843 (2021)  
Target
Name:
Potassium voltage-gated channel subfamily H member 2
Synonyms:
1,3-beta-glucan synthase component GLS2 ERG Eag-related protein 1 Ether-a-go-go-related gene (HERG) Ether-a-go-go-related gene potassium channel 1 Ether-a-go-go-related gene potassium channel 1 (hERG1) Ether-a-go-go-related protein 1 H-ERG KCNH2 Potassium voltage-gated channel subfamily H member 2 (hERG) Voltage-gated potassium channel subunit Kv11.1 hERG Potassium Channel 1 | putative potassium channel subunit
Type:
Multi-pass membrane protein
Mol. Mass.:
126672.65
Organism:
Homo sapiens (Human)
Description:
Q12809
Residue:
1159
  
Inhibitor
Name:
BDBM50557457
Synonyms:
CHEMBL4742712
Type:
Small organic molecule
Emp. Form.:
C22H18ClF2N3O4
Mol. Mass.:
461.846
SMILES:
FC(F)(C(=O)NCc1ccc2C(=O)N(Cc2c1)C1CCC(=O)NC1=O)c1ccc(Cl)cc1
: