Target
Prostaglandin G/H synthase 1
Ligand
BDBM50118681
Substrate
Meas. Tech.
ChEBML_158750
IC50
>100000±n/a nM
Citation
 Rahim, MARao, PNKnaus, EE Isomeric acetoxy analogues of rofecoxib: a novel class of highly potent and selective cyclooxygenase-2 inhibitors. Bioorg Med Chem Lett 12:2753-6 (2002)  
Target
Name:
Prostaglandin G/H synthase 1
Synonyms:
COX-1 Cyclooxygenase Cyclooxygenase-1 (COX-1) PTGS1 | Prostaglandin G/H synthase (cyclooxygenase)
Type:
Enzyme
Mol. Mass.:
68692.62
Organism:
Homo sapiens (Human)
Description:
P23219
Residue:
599
  
Inhibitor
Name:
BDBM50118681
Synonyms:
Acetic acid 2-[4-(4-methanesulfonyl-phenyl)-2-oxo-2,5-dihydro-furan-3-yl]-phenyl ester | CHEMBL328616
Type:
Small organic molecule
Emp. Form.:
C19H16O6S
Mol. Mass.:
372.392
SMILES:
CC(=O)Oc1ccccc1C1=C(COC1=O)c1ccc(cc1)S(C)(=O)=O
: