Target
Prostaglandin G/H synthase 1
Ligand
BDBM50118685
Substrate
Meas. Tech.
ChEBML_158750
IC50
>250000±n/a nM
Citation
 Rahim, MARao, PNKnaus, EE Isomeric acetoxy analogues of rofecoxib: a novel class of highly potent and selective cyclooxygenase-2 inhibitors. Bioorg Med Chem Lett 12:2753-6 (2002)  
Target
Name:
Prostaglandin G/H synthase 1
Synonyms:
COX-1 Cyclooxygenase Cyclooxygenase-1 (COX-1) PTGS1 | Prostaglandin G/H synthase (cyclooxygenase)
Type:
Enzyme
Mol. Mass.:
68692.62
Organism:
Homo sapiens (Human)
Description:
P23219
Residue:
599
  
Inhibitor
Name:
BDBM50118685
Synonyms:
3-(3-Hydroxy-phenyl)-4-(4-methanesulfonyl-phenyl)-5H-furan-2-one | CHEMBL91923
Type:
Small organic molecule
Emp. Form.:
C17H14O5S
Mol. Mass.:
330.355
SMILES:
CS(=O)(=O)c1ccc(cc1)C1=C(C(=O)OC1)c1cccc(O)c1
: