Target
Serine/threonine-protein kinase B-raf
Ligand
BDBM50557775
Substrate
Meas. Tech.
ChEMBL_2060071 (CHEMBL4715072)
Ki
<0.080000±n/a nM
Citation
 Huestis, MPDurk, MREigenbrot, CGibbons, PHunsaker, TLLa, HLeung, DHLiu, WMalek, SMerchant, MMoffat, JGMuli, CSOrr, CJParr, BTShanahan, FSneeringer, CJWang, WYen, IYin, JRudolph, JSiu, M Targeting KRAS Mutant Cancers via Combination Treatment: Discovery of a Pyridopyridazinone pan-RAF Kinase Inhibitor. ACS Med Chem Lett 12:791-797 (2021)  
Target
Name:
Serine/threonine-protein kinase B-raf
Synonyms:
B-RAF B-Raf proto-oncogene serine/threonine-protein kinase BRAF1 RAFB1 v-Raf murine sarcoma viral oncogene homolog B1
Type:
Serine/threonine-protein kinase
Mol. Mass.:
84446.00
Organism:
Homo sapiens (Human)
Description:
P15056
Residue:
766
  
Inhibitor
Name:
BDBM50557775
Synonyms:
CHEMBL4758903
Type:
Small organic molecule
Emp. Form.:
C27H23FN4O2
Mol. Mass.:
454.4955
SMILES:
Cc1cc(F)c(NC(=O)c2cccc(c2)C(C)(C)C#N)cc1-c1ccc2c(cnn(C)c2=O)c1
: