Target
Beta-1 adrenergic receptor
Ligand
BDBM50119197
Substrate
Meas. Tech.
ChEMBL_37244 (CHEMBL651565)
EC50
50±n/a nM
Citation
 Steffan, RJAshwell, MASolvibile, WRMatelan, ELargis, EHan, STillet, JMulvey, R Novel substituted 4-aminomethylpiperidines as potent and selective human beta3-agonists. Part 2: arylethanolaminomethylpiperidines. Bioorg Med Chem Lett 12:2963-7 (2002)  
Target
Name:
Beta-1 adrenergic receptor
Synonyms:
ADRB1 ADRB1_HUMAN Beta-1 adrenoceptor | adrenergic Beta1
Type:
G Protein-Coupled Receptor (GPCR)
Mol. Mass.:
51338.40
Organism:
Homo sapiens (Human)
Description:
P08588
Residue:
477
  
Inhibitor
Name:
BDBM50119197
Synonyms:
1-[4-(4-{[2-Hydroxy-2-(4-hydroxy-3-methanesulfonylamino-phenyl)-ethylamino]-methyl}-piperidine-1-sulfonyl)-phenyl]-1H-indole-4-carboxylic acid | CHEMBL100351
Type:
Small organic molecule
Emp. Form.:
C30H34N4O8S2
Mol. Mass.:
642.743
SMILES:
CS(=O)(=O)Nc1cc(ccc1O)[C@@H](O)CNCC1CCN(CC1)S(=O)(=O)c1ccc(cc1)-n1ccc2c(cccc12)C(O)=O
: