Target
Adenosine receptor A1
Ligand
BDBM50120759
Substrate
Meas. Tech.
ChEMBL_29129 (CHEMBL642433)
Ki
27.2±n/a nM
Citation
 Novellino, EAbignente, ECosimelli, BGreco, GIadanza, MLaneri, SLavecchia, ARimoli, MGSettimo, FDPrimofiore, GTuscano, DTrincavelli, LMartini, C Design, synthesis and biological evaluation of novel N-alkyl- and N-acyl-(7-substituted-2-phenylimidazo[1,2-a][1,3,5]triazin-4-yl)amines (ITAs) as novel A(1) adenosine receptor antagonists. J Med Chem 45:5030-6 (2002)  
Target
Name:
Adenosine receptor A1
Synonyms:
AA1R_BOVIN ADENOSINE A1 high ADORA1 | Adenosine A1 receptor
Type:
Enzyme Catalytic Domain
Mol. Mass.:
36602.99
Organism:
BOVINE
Description:
ADENOSINE 0 BOVINE::P28190
Residue:
326
  
Inhibitor
Name:
BDBM50120759
Synonyms:
CHEMBL146479 N-(7-methyl-2-phenylimidazo[1,2-a][1,3,5]triazin-4-yl)benzamide
Type:
Small organic molecule
Emp. Form.:
C19H15N5O
Mol. Mass.:
329.3553
SMILES:
Cc1cn2c(NC(=O)c3ccccc3)nc(nc2n1)-c1ccccc1
: