Target
Adenosine receptor A2a
Ligand
BDBM50120767
Substrate
Meas. Tech.
ChEMBL_30745 (CHEMBL649776)
Ki
>10000±n/a nM
Citation
 Novellino, EAbignente, ECosimelli, BGreco, GIadanza, MLaneri, SLavecchia, ARimoli, MGSettimo, FDPrimofiore, GTuscano, DTrincavelli, LMartini, C Design, synthesis and biological evaluation of novel N-alkyl- and N-acyl-(7-substituted-2-phenylimidazo[1,2-a][1,3,5]triazin-4-yl)amines (ITAs) as novel A(1) adenosine receptor antagonists. J Med Chem 45:5030-6 (2002)  
Target
Name:
Adenosine receptor A2a
Synonyms:
A2A adenosine receptor (hA2A) ADENOSINE A2 ADORA2 Adenosine A2A receptor (A2AAR)
Type:
G Protein-Coupled Receptor (GPCR)
Mol. Mass.:
44716.46
Organism:
Homo sapiens (Human)
Description:
P29274
Residue:
412
  
Inhibitor
Name:
BDBM50120767
Synonyms:
CHEMBL148464 | Cyclopentanecarboxylic acid (7-isopropyl-2-phenyl-imidazo[1,2-a][1,3,5]triazin-4-yl)-amide
Type:
Small organic molecule
Emp. Form.:
C20H23N5O
Mol. Mass.:
349.4295
SMILES:
CC(C)c1cn2c(NC(=O)C3CCCC3)nc(nc2n1)-c1ccccc1
: