Target
Far upstream element-binding protein 1
Ligand
BDBM50558632
Substrate
Meas. Tech.
ChEMBL_2064177 (CHEMBL4719430)
IC50
84800±n/a nM
Citation
 Hauck, SHiesinger, KKhageh Hosseini, SAchenbach, JBiondi, RMProschak, EZörnig, MOdadzic, D Pyrazolo[1,5a]pyrimidines as a new class of FUSE binding protein 1 (FUBP1) inhibitors. Bioorg Med Chem 24:5717-5729 (2016)  
Target
Name:
Far upstream element-binding protein 1
Synonyms:
DNA helicase V FUBP1 FUSE-binding protein 1 hDH V
Type:
PROTEIN
Mol. Mass.:
67565.13
Organism:
Homo sapiens
Description:
ChEMBL_118167
Residue:
644
  
Inhibitor
Name:
BDBM50558632
Synonyms:
CHEMBL4752987
Type:
Small organic molecule
Emp. Form.:
C22H18F3N3O2
Mol. Mass.:
413.3924
SMILES:
COc1ccc(cc1OC)-c1cc(n2nc(cc2n1)-c1ccc(C)cc1)C(F)(F)F
: