Target
Transient receptor potential cation channel subfamily V member 1
Ligand
BDBM50558639
Substrate
Meas. Tech.
ChEMBL_2064205 (CHEMBL4719458)
EC50
45940±n/a nM
Citation
 Pretze, MPallavi, PRoscher, MKlotz, SCaballero, JBinzen, UGreffrath, WTreede, RDHarmsen, MCHafner, MYard, BWängler, CWängler, B Radiofluorinated N-Octanoyl Dopamine ([ J Med Chem 59:9855-9865 (2016)  
Target
Name:
Transient receptor potential cation channel subfamily V member 1
Synonyms:
Capsaicin receptor TRPV1_RAT Trpv1 Vanilloid VR1 Vanilloid receptor 1 (VRI/TRPV1) Vanilloid receptor type 1-like (TrpV1/Vr1) Vr1l | osm-9-like TRP channel 1
Type:
Transient Receptor
Mol. Mass.:
94956.12
Organism:
Rattus norvegicus (rat)
Description:
O35433
Residue:
838
  
Inhibitor
Name:
BDBM50558639
Synonyms:
CHEMBL4789649
Type:
Small organic molecule
Emp. Form.:
C16H24FNO3
Mol. Mass.:
297.3651
SMILES:
CCCCCCCC(=O)NCCc1cc(O)c(O)cc1F
: