Target
Kappa-type opioid receptor
Ligand
BDBM50120874
Substrate
Meas. Tech.
ChEMBL_145551 (CHEMBL751015)
IC50
>1000±n/a nM
Citation
 Ogawa, TMiyamae, TMurayama, KOkuyama, KOkayama, THagiwara, MSakurada, SMorikawa, T Synthesis and structure-activity relationships of an orally available and long-acting analgesic peptide, N(alpha)-amidino-Tyr-D-Arg-Phe-MebetaAla-OH (ADAMB). J Med Chem 45:5081-9 (2002)  
Target
Name:
Kappa-type opioid receptor
Synonyms:
KOR-1 OPIATE Kappa Oprk1
Type:
Enzyme
Mol. Mass.:
42656.78
Organism:
Mus musculus (Mouse)
Description:
P33534
Residue:
380
  
Inhibitor
Name:
BDBM50120874
Synonyms:
2-(2-{5-Guanidino-2-[3-(3-hydroxy-phenyl)-2-methoxyamino-propionylamino]-pentanoylamino}-3-phenyl-propionylamino)-propionic acid | CHEMBL344108
Type:
Small organic molecule
Emp. Form.:
C28H39N7O7
Mol. Mass.:
585.652
SMILES:
CON[C@@H](Cc1cccc(O)c1)C(=O)N[C@@H](CCCNC(N)=N)C(=O)N[C@@H](Cc1ccccc1)C(=O)N[C@@H](C)C(O)=O
: