Target
Mu-type opioid receptor
Ligand
BDBM50120878
Substrate
Meas. Tech.
ChEMBL_148383 (CHEMBL757378)
IC50
12.9±n/a nM
Citation
 Ogawa, TMiyamae, TMurayama, KOkuyama, KOkayama, THagiwara, MSakurada, SMorikawa, T Synthesis and structure-activity relationships of an orally available and long-acting analgesic peptide, N(alpha)-amidino-Tyr-D-Arg-Phe-MebetaAla-OH (ADAMB). J Med Chem 45:5081-9 (2002)  
Target
Name:
Mu-type opioid receptor
Synonyms:
M-OR-1 Mor OPRM_MOUSE Oprm | Oprm1
Type:
Enzyme Catalytic Domain
Mol. Mass.:
44431.62
Organism:
MOUSE
Description:
OPIATE Mu OPRM1 MOUSE::P42866
Residue:
398
  
Inhibitor
Name:
BDBM50120878
Synonyms:
2-[(2-{5-Guanidino-2-[2-guanidino-3-(3-hydroxy-phenyl)-propionylamino]-pentanoylamino}-3-phenyl-propionyl)-methyl-amino]-propionic acid | CHEMBL149867
Type:
Small organic molecule
Emp. Form.:
C29H41N9O6
Mol. Mass.:
611.6925
SMILES:
[#6]-[#6@H](-[#7](-[#6])-[#6](=O)-[#6@H](-[#6]-c1ccccc1)-[#7]-[#6](=O)-[#6@H](-[#6]-[#6]-[#6]-[#7]-[#6](-[#7])=[#7])-[#7]-[#6](=O)-[#6@H](-[#6]-c1cccc(-[#8])c1)\[#7]=[#6](/[#7])-[#7])-[#6](-[#8])=O
: