Target
Trace amine-associated receptor 1
Ligand
BDBM50558645
Substrate
Meas. Tech.
ChEMBL_2064211 (CHEMBL4719464)
EC50
>10000±n/a nM
Citation
 Chiellini, GNesi, GSestito, SChiarugi, SRunfola, MEspinoza, SSabatini, MBellusci, LLaurino, ACichero, EGainetdinov, RRFossa, PRaimondi, LZucchi, RRapposelli, S Hit-to-Lead Optimization of Mouse Trace Amine Associated Receptor 1 (mTAAR1) Agonists with a Diphenylmethane-Scaffold: Design, Synthesis, and Biological Study. J Med Chem 59:9825-9836 (2016)  
Target
Name:
Trace amine-associated receptor 1
Synonyms:
TAAR1_MOUSE Taar1 Trace amine receptor 1 (TARR1) Trace amine-associated receptor1 | Trar1
Type:
Protein
Mol. Mass.:
37635.41
Organism:
Mus musculus (Mouse)
Description:
Q923Y8
Residue:
332
  
Inhibitor
Name:
BDBM50558645
Synonyms:
CHEMBL4764889
Type:
Small organic molecule
Emp. Form.:
C17H20N2O2
Mol. Mass.:
284.3529
SMILES:
CC(=O)Nc1ccc(Cc2ccc(OCCN)cc2)cc1
: