Target
Dual specificity tyrosine-phosphorylation-regulated kinase 1A
Ligand
BDBM50434352
Substrate
Meas. Tech.
ChEMBL_2064252 (CHEMBL4719505)
IC50
0.940000±n/a nM
Citation
 Chaikuad, ADiharce, JSchröder, MFoucourt, ALeblond, BCasagrande, ASDésiré, LBonnet, PKnapp, SBesson, T An Unusual Binding Model of the Methyl 9-Anilinothiazolo[5,4-f] quinazoline-2-carbimidates (EHT 1610 and EHT 5372) Confers High Selectivity for Dual-Specificity Tyrosine Phosphorylation-Regulated Kinases. J Med Chem 59:10315-10321 (2016)  
Target
Name:
Dual specificity tyrosine-phosphorylation-regulated kinase 1A
Synonyms:
DYR1A_HUMAN DYRK1A Dual specificity YAK1-related kinase 1A (Dyrk1A) Dual-specificity tyrosine-phosphorylation regulated kinase 1A HP86 MNBH
Type:
Enzyme
Mol. Mass.:
85616.61
Organism:
Homo sapiens (Human)
Description:
Q13627
Residue:
763
  
Inhibitor
Name:
BDBM50434352
Synonyms:
CHEMBL2386748 | US9446044, 78
Type:
Small organic molecule
Emp. Form.:
C17H11F2N5OS
Mol. Mass.:
371.364
SMILES:
COC(=N)c1nc2ccc3ncnc(Nc4ccc(F)cc4F)c3c2s1
: