Target
Dual specificity tyrosine-phosphorylation-regulated kinase 1A
Ligand
BDBM100152
Substrate
Meas. Tech.
ChEMBL_2064252 (CHEMBL4719505)
IC50
22±n/a nM
Citation
 Chaikuad, ADiharce, JSchröder, MFoucourt, ALeblond, BCasagrande, ASDésiré, LBonnet, PKnapp, SBesson, T An Unusual Binding Model of the Methyl 9-Anilinothiazolo[5,4-f] quinazoline-2-carbimidates (EHT 1610 and EHT 5372) Confers High Selectivity for Dual-Specificity Tyrosine Phosphorylation-Regulated Kinases. J Med Chem 59:10315-10321 (2016)  
Target
Name:
Dual specificity tyrosine-phosphorylation-regulated kinase 1A
Synonyms:
DYR1A_HUMAN DYRK1A Dual specificity YAK1-related kinase 1A (Dyrk1A) Dual-specificity tyrosine-phosphorylation regulated kinase 1A HP86 MNBH
Type:
Enzyme
Mol. Mass.:
85616.61
Organism:
Homo sapiens (Human)
Description:
Q13627
Residue:
763
  
Inhibitor
Name:
BDBM100152
Synonyms:
7-methoxy-1-methyl-9H-beta-carboline;hydrochloride HARMINE MLS002153910 cid_5359389
Type:
Small organic molecule
Emp. Form.:
C13H12N2O
Mol. Mass.:
212.2472
SMILES:
COc1ccc2c(c1)[nH]c1c(C)nccc21
: