Target
Dual specificity tyrosine-phosphorylation-regulated kinase 1B
Ligand
BDBM246383
Substrate
Meas. Tech.
ChEMBL_2064255 (CHEMBL4719508)
IC50
0.590000±n/a nM
Citation
 Chaikuad, ADiharce, JSchröder, MFoucourt, ALeblond, BCasagrande, ASDésiré, LBonnet, PKnapp, SBesson, T An Unusual Binding Model of the Methyl 9-Anilinothiazolo[5,4-f] quinazoline-2-carbimidates (EHT 1610 and EHT 5372) Confers High Selectivity for Dual-Specificity Tyrosine Phosphorylation-Regulated Kinases. J Med Chem 59:10315-10321 (2016)  
Target
Name:
Dual specificity tyrosine-phosphorylation-regulated kinase 1B
Synonyms:
DYR1B_HUMAN Dual specificity tyrosine-phosphorylation-regulated kinase 1B MIRK
Type:
Enzyme
Mol. Mass.:
69222.24
Organism:
Homo sapiens (Human)
Description:
Q9Y463
Residue:
629
  
Inhibitor
Name:
BDBM246383
Synonyms:
US9446044, 69
Type:
Small organic molecule
Emp. Form.:
C18H14FN5O2S
Mol. Mass.:
383.399
SMILES:
COC(=N)c1nc2ccc3ncnc(Nc4ccc(OC)cc4F)c3c2s1
: