Target
Dual specificity tyrosine-phosphorylation-regulated kinase 4
Ligand
BDBM246383
Substrate
Meas. Tech.
ChEMBL_2064262 (CHEMBL4719515)
IC50
1570±n/a nM
Citation
 Chaikuad, ADiharce, JSchröder, MFoucourt, ALeblond, BCasagrande, ASDésiré, LBonnet, PKnapp, SBesson, T An Unusual Binding Model of the Methyl 9-Anilinothiazolo[5,4-f] quinazoline-2-carbimidates (EHT 1610 and EHT 5372) Confers High Selectivity for Dual-Specificity Tyrosine Phosphorylation-Regulated Kinases. J Med Chem 59:10315-10321 (2016)  
Target
Name:
Dual specificity tyrosine-phosphorylation-regulated kinase 4
Synonyms:
DYRK4 | DYRK4_HUMAN
Type:
PROTEIN
Mol. Mass.:
59629.96
Organism:
Homo sapiens (Human)
Description:
ChEMBL_1475744
Residue:
520
  
Inhibitor
Name:
BDBM246383
Synonyms:
US9446044, 69
Type:
Small organic molecule
Emp. Form.:
C18H14FN5O2S
Mol. Mass.:
383.399
SMILES:
COC(=N)c1nc2ccc3ncnc(Nc4ccc(OC)cc4F)c3c2s1
: